Reaction Details
TargetPolyphenol oxidase 1
LigandBDBM50382706
Substrate/Competitorn/a
Meas. Tech.MT Kinetic Assay
pH6.8±0
Temperature300.15±0 K
Ki 1.41e+4± 2.1e+3 nM
Citation Amin, ESaboury, AAMansuri-Torshizi, HMoosavi-Movahedi, AA Potent inhibitory effects of benzyl and p-xylidine-bis dithiocarbamate sodium salts on activities of mushroom tyrosinase. J Enzyme Inhib Med Chem25:272-81 (2010) 
 
Polyphenol oxidase 1
Name:Polyphenol oxidase 1
Type:Enzyme
Mol. Mass.:63902.83
Organism:Agaricus bisporus (White button mushroom)
Description:Q00024
Residue:568
BDBM50382706
NameBDBM50382706
Synonyms:Benzyldithiocarbamate sodium salt (I) | CHEMBL2023168
TypeSmall organic molecule
Emp. Form.C8H8NS2
Mol. Mass.182.286
SMILES[S-]C(=S)NCc1ccccc1