Reaction Details
TargetcDNA, FLJ78895, highly similar to 3-oxo-5-alpha-steroid 4-dehydrogenase 1
LigandBDBM233043
Substrate/Competitorn/a
Meas. Tech.5α-Reductase Activity Assay
pH6.5±0
Temperature310.15±0 K
IC50 19±0.0 nM
Citation Bratoeff, EZambrano, AHeuze, IPalacios, ARamírez, DCabeza, M Synthesis and biological activity of progesterone derivatives as 5alpha-reductase inhibitors, and their effect on hamster prostate weight. J Enzyme Inhib Med Chem25:306-11 (2010) 
 
cDNA, FLJ78895, highly similar to 3-oxo-5-alpha-steroid 4-dehydrogenase 1
Name:cDNA, FLJ78895, highly similar to 3-oxo-5-alpha-steroid 4-dehydrogenase 1
Synonyms:5-alpha-Reductase (5α-Reductase)
Type:Enzyme
Mol. Mass.:24182.16
Organism:Homo sapiens (Human)
Description:EC 1.3.99.5; B7Z4L2
Residue:212
BDBM233043
NameBDBM233043
Synonyms:6-Chloro-3,20-dioxopregna-4,6-diene-17α-yl acetate (9)
TypeSmall organic molecule
Emp. Form.C23H29ClO4
Mol. Mass.404.927
SMILESCC(=O)O[C@@]1(CCC2C3C=C(Cl)C4=CC(=O)CC[C@]4(C)C3CC[C@]12C)C(C)=O