Reaction Details
Target3-oxoacyl-[acyl-carrier-protein] synthase 3
LigandBDBM233064
Substrate/Competitorn/a
Meas. Tech.3D-QSAR
IC50 51000±n/a nM
Citation Lu, XChen, YYou, Q 3D-QSAR, molecular docking studies, and binding mode prediction of thiolactomycin analogs as mtFabH inhibitors. J Enzyme Inhib Med Chem25:240-9 (2010) 
 
3-oxoacyl-[acyl-carrier-protein] synthase 3
Name:3-oxoacyl-[acyl-carrier-protein] synthase 3
Type:Enzyme
Mol. Mass.:34865.07
Organism:Mycobacterium tuberculosis
Description:P9WNG3
Residue:335
BDBM233064
NameBDBM233064
Synonyms:mtFabH inhibitor, 17
TypeSmall organic molecule
Emp. Form.C19H18O2S
Mol. Mass.310.41
SMILESCC1=C(O)C(C)(Cc2ccc(cc2)-c2ccccc2)SC1=O