Reaction Details
TargetSerine/threonine-protein kinase pim-1
LigandBDBM161992
Substrate/Competitorn/a
Meas. Tech.PIM-1 Biochemical Assay
IC50<100±n/a nM
Citation Pastor Fernández, JRamos Lima, FJHernandez Higueras, AIMartínez González, SMartín Hernando, JISaluste, CPGonzalez Cantalapiedra, EBlanco Aparicio, CRodríguez Hergueta, AGarcia Collazo, AMSalgado Serrano, ANoya Marino, B Tricyclic compounds for use as kinase inhibitors US Patent US9682991 Publication Date 6/20/2017
 
Serine/threonine-protein kinase pim-1
Name:Serine/threonine-protein kinase pim-1
Type:Protein
Mol. Mass.:35681.82
Organism:Homo sapiens (Human)
Description:P11309
Residue:313
BDBM161992
NameBDBM161992
Synonyms:US9682991, 41
TypeSmall organic molecule
Emp. Form.C21H23F3N6O3
Mol. Mass.464.4409
SMILESCN1CCC(CNc2nn3c(nnc3c3OCCOc23)-c2cccc(OC(F)(F)F)c2)CC1