Reaction Details
TargetSerine/threonine-protein kinase pim-1
LigandBDBM161997
Substrate/Competitorn/a
Meas. Tech.PIM-1 Biochemical Assay
IC50<100±n/a nM
Citation Pastor Fernández, JRamos Lima, FJHernandez Higueras, AIMartínez González, SMartín Hernando, JISaluste, CPGonzalez Cantalapiedra, EBlanco Aparicio, CRodríguez Hergueta, AGarcia Collazo, AMSalgado Serrano, ANoya Marino, B Tricyclic compounds for use as kinase inhibitors US Patent US9682991 Publication Date 6/20/2017
 
Serine/threonine-protein kinase pim-1
Name:Serine/threonine-protein kinase pim-1
Type:Protein
Mol. Mass.:35681.82
Organism:Homo sapiens (Human)
Description:P11309
Residue:313
BDBM161997
NameBDBM161997
Synonyms:US9682991, 48
TypeSmall organic molecule
Emp. Form.C23H26F3N7O2
Mol. Mass.489.4934
SMILESCN1CCOc2c1c(nn1c(nnc21)-c1cccc(OC(F)(F)F)c1)N1CCC2(CC(N)C2)CC1