Reaction Details
TargetSerine/threonine-protein kinase pim-1
LigandBDBM162014
Substrate/Competitorn/a
Meas. Tech.PIM-1 Biochemical Assay
IC50<100±n/a nM
Citation Pastor Fernández, JRamos Lima, FJHernandez Higueras, AIMartínez González, SMartín Hernando, JISaluste, CPGonzalez Cantalapiedra, EBlanco Aparicio, CRodríguez Hergueta, AGarcia Collazo, AMSalgado Serrano, ANoya Marino, B Tricyclic compounds for use as kinase inhibitors US Patent US9682991 Publication Date 6/20/2017
 
Serine/threonine-protein kinase pim-1
Name:Serine/threonine-protein kinase pim-1
Type:Protein
Mol. Mass.:35681.82
Organism:Homo sapiens (Human)
Description:P11309
Residue:313
BDBM162014
NameBDBM162014
Synonyms:US9682991, 70
TypeSmall organic molecule
Emp. Form.C21H24F3N7O2
Mol. Mass.463.4562
SMILESCN1CCOc2c1c(N[C@@H]1CC[C@H](N)CC1)nn1c(nnc21)-c1cccc(OC(F)(F)F)c1