Reaction Details
TargetSerine/threonine-protein kinase pim-3
LigandBDBM162043
Substrate/Competitorn/a
Meas. Tech.PIM-3 Biochemical Assay
IC50<100±n/a nM
Citation Pastor Fernández, JRamos Lima, FJHernandez Higueras, AIMartínez González, SMartín Hernando, JISaluste, CPGonzalez Cantalapiedra, EBlanco Aparicio, CRodríguez Hergueta, AGarcia Collazo, AMSalgado Serrano, ANoya Marino, B Tricyclic compounds for use as kinase inhibitors US Patent US9682991 Publication Date 6/20/2017
 
Serine/threonine-protein kinase pim-3
Name:Serine/threonine-protein kinase pim-3
Type:Protein
Mol. Mass.:35888.19
Organism:Homo sapiens (Human)
Description:Q86V86
Residue:326
BDBM162043
NameBDBM162043
Synonyms:US9682991, 97
TypeSmall organic molecule
Emp. Form.C21H23F3N6O3
Mol. Mass.464.4409
SMILESCN(C1CCOCC1)c1nn2c(nnc2c2OCCN(C)c12)-c1cccc(OC(F)(F)F)c1