Reaction Details
Target6-phosphogluconate dehydrogenase, decarboxylating
LigandBDBM18050
Substrate/Competitorn/a
Meas. Tech.In Vitro Assay
Ki 136700±25300 nM
IC50 142000±0.0 nM
Citation Akkemik, EBudak, HCiftci, M Effects of some drugs on human erythrocyte 6-phosphogluconate dehydrogenase: an in vitro study. J Enzyme Inhib Med Chem25:476-9 (2010) 
 
6-phosphogluconate dehydrogenase, decarboxylating
Name:6-phosphogluconate dehydrogenase, decarboxylating
Type:Protein
Mol. Mass.:53143.42
Organism:Homo sapiens (Human)
Description:P52209
Residue:483
BDBM18050
NameBDBM18050
Synonyms:2-[(4-{[(2,4-diaminopteridin-6-yl)methyl](methyl)amino}phenyl)formamido]pentanedioic acid MTX cid_126941
TypeSmall organic molecule
Emp. Form.C20H22N8O5
Mol. Mass.454.4393
SMILESCN(Cc1cnc2nc(N)nc(N)c2n1)c1ccc(cc1)C(=O)N[C@@H](CCC(O)=O)C(O)=O