Reaction Details
TargetGlucose-6-phosphate 1-dehydrogenase
LigandBDBM18050
Substrate/Competitorn/a
Meas. Tech.In Vitro Inhibition Assay
Ki 9.10e+4± 1.66e+4 nM
IC50 1.14e+5±n/a nM
Citation Akkemik, EBudak, HCiftci, M Effects of some drugs on human erythrocyte glucose 6-phosphate dehydrogenase: an in vitro study. J Enzyme Inhib Med Chem25:871-5 (2010) 
 
Glucose-6-phosphate 1-dehydrogenase
Name:Glucose-6-phosphate 1-dehydrogenase
Type:Enzyme
Mol. Mass.:59258.58
Organism:Homo sapiens (Human)
Description:P11413
Residue:515
BDBM18050
NameBDBM18050
Synonyms:2-[(4-{[(2,4-diaminopteridin-6-yl)methyl](methyl)amino}phenyl)formamido]pentanedioic acid MTX cid_126941
TypeSmall organic molecule
Emp. Form.C20H22N8O5
Mol. Mass.454.4393
SMILESCN(Cc1cnc2nc(N)nc(N)c2n1)c1ccc(cc1)C(=O)N[C@@H](CCC(O)=O)C(O)=O