Reaction Details
TargetNeuromedin-K receptor
LigandBDBM233244
Substrate/Competitorn/a
Meas. Tech.[3H]SR142801 Competition Binding Assay
pH7.4±n/a
Temperature277.15±n/a K
Ki 2±n/a nM
Commentsextracted
Citation Knust, HKoblet, ANettekoven, MRatni, HRiemer, CVifian, W Pyrrolidine compounds US Patent US9346786 Publication Date 5/24/2016
 
Neuromedin-K receptor
Name:Neuromedin-K receptor
Type:Enzyme
Mol. Mass.:52221.96
Organism:Homo sapiens (Human)
Description:P29371
Residue:465
BDBM233244
NameBDBM233244
Synonyms:US9346786, 48
TypeSmall organic molecule
Emp. Form.C31H30F3N5O3
Mol. Mass.577.5968
SMILESCCN([C@@H]1CN(C[C@H]1c1ccc(F)c(F)c1)C(=O)C1CCN(CC1)c1ccc(cn1)C#N)C(=O)Oc1ccc(F)cc1