Reaction Details
TargetEnteropeptidase
LigandBDBM234266
Substrate/Competitorn/a
Meas. Tech.Inhibition Assay
pH8±n/a
Ki 0.20±n/a nM
Commentsextracted
Citation Suzuki, TKoshiba, TTokumasu, MOhsumi, K Heterocyclic carboxylic acid ester derivative US Patent US9346821 Publication Date 5/24/2016
 
Enteropeptidase
Name:Enteropeptidase
Type:Enzyme
Mol. Mass.:112901.62
Organism:Homo sapiens (Human)
Description:P98073
Residue:1019
BDBM234266
NameBDBM234266
Synonyms:US9346821, B-55
TypeSmall organic molecule
Emp. Form.C20H19FN4O7S
Mol. Mass.478.451
SMILESNC(=N)c1ccc(OC(=O)c2cc3CCN(Cc3s2)C(=O)N[C@@H](CC(O)=O)C(O)=O)c(F)c1