Reaction Details
TargetCytosol aminopeptidase [33-68,L62W]
LigandBDBM234299
Substrate/Competitorn/a
Meas. Tech.Kinetic Inhibition Assay
pH8.4±0
Temperature298.15±0 K
Ki 2.19e+5±n/a nM
Citation Pícha, JLiboska, RBude?ínský, MJirácek, JPawelczak, MMucha, A Unusual activity pattern of leucine aminopeptidase inhibitors based on phosphorus containing derivatives of methionine and norleucine. J Enzyme Inhib Med Chem26:155-61 (2011) 
 
Cytosol aminopeptidase [33-68,L62W]
Name:Cytosol aminopeptidase [33-68,L62W]
Type:Enzyme
Mol. Mass.:4015.44
Organism:Sus scrofa (Pig)
Description:P28839[33-68,L62W]
Residue:36
BDBM234299
NameBDBM234299
Synonyms:Nle-ψ[P(O)(OH)O]-L-AlaOMe (7)
TypeSmall organic molecule
Emp. Form.C9H20NO5P
Mol. Mass.253.2326
SMILESCCCCC(N)P(O)(=O)O[C@@H](C)C(=O)OC