Reaction Details
TargetSeed linoleate 9S-lipoxygenase-3
LigandBDBM50379791
Substrate/Competitorn/a
Meas. Tech.Lipoxygenase Activity Assay
pH9±n/a
Temperature274.15±n/a K
IC50 96100±3300 nM
Commentsextracted
Citation Sadeghian, HSeyedi, SMAttaran, NJabbari, AJafari, Z Synthesis and SAR comparative studies of 2-allyl-4-methoxy-1-alkoxybenzenes as 15-lipoxygenase inhibitors. J Enzyme Inhib Med Chem26:238-44 (2011) 
 
Seed linoleate 9S-lipoxygenase-3
Name:Seed linoleate 9S-lipoxygenase-3
Type:Enzyme
Mol. Mass.:96760.05
Organism:Glycine max (Soybean)
Description:P09186
Residue:857
BDBM50379791
NameBDBM50379791
Synonyms:METHYLEUGENOL | Methyl eugenol (1)
TypeSmall organic molecule
Emp. Form.C11H14O2
Mol. Mass.178.2277
SMILESCOc1ccc(CC=C)cc1OC