Reaction Details
TargetSeed linoleate 9S-lipoxygenase-3
LigandBDBM234359
Substrate/Competitorn/a
Meas. Tech.Lipoxygenase Activity Assay
pH9±n/a
Temperature274.15±n/a K
Ki 3880±n/a nM
IC50 34300±2300 nM
Commentsextracted
Citation Sadeghian, HSeyedi, SMAttaran, NJabbari, AJafari, Z Synthesis and SAR comparative studies of 2-allyl-4-methoxy-1-alkoxybenzenes as 15-lipoxygenase inhibitors. J Enzyme Inhib Med Chem26:238-44 (2011) 
 
Seed linoleate 9S-lipoxygenase-3
Name:Seed linoleate 9S-lipoxygenase-3
Type:Enzyme
Mol. Mass.:96760.05
Organism:Glycine max (Soybean)
Description:P09186
Residue:857
BDBM234359
NameBDBM234359
Synonyms:2-Allyl-4-methoxy-1-propoxybenzene (4c)
TypeSmall organic molecule
Emp. Form.C13H18O2
Mol. Mass.206.2808
SMILESCCCOc1ccc(OC)cc1CC=C