Reaction Details
TargetUDP-glucuronosyltransferase 1-6
LigandBDBM50001839
Substrate/Competitor1-Naphthol
Meas. Tech.UDP-glucuronosyltransferase Activity Assay
IC50 7.4e+4± 3e+3 nM
Citation Liu, YShe, MWu, ZDai, R The inhibition study of human UDP-glucuronosyltransferases with cytochrome P450 selective substrates and inhibitors. J Enzyme Inhib Med Chem26:386-93 (2011) 
 
UDP-glucuronosyltransferase 1-6
Name:UDP-glucuronosyltransferase 1-6
Type:Enzyme
Mol. Mass.:60765.14
Organism:Homo sapiens (Human)
Description:P19224
Residue:532
BDBM50001839
1-Naphthol
NameBDBM50001839
Synonyms:CHEMBL428647 taxol
TypeSmall organic molecule
Emp. Form.C47H51NO14
Mol. Mass.853.9061
SMILESCC(=O)O[C@@H]1C2=C(C)[C@H](C[C@@](O)([C@@H](OC(=O)c3ccccc3)[C@@H]3[C@@]4(CO[C@@H]4C[C@H](O)[C@@]3(C)C1=O)OC(C)=O)C2(C)C)OC(=O)[C@H](O)[C@@H](NC(=O)c1ccccc1)c1ccccc1