Reaction Details
TargetUDP-glucuronosyltransferase 1-6
LigandBDBM234400
Substrate/Competitor1-Naphthol
Meas. Tech.UDP-glucuronosyltransferase Activity Assay
IC50>3.00e+5±n/a nM
Citation Liu, YShe, MWu, ZDai, R The inhibition study of human UDP-glucuronosyltransferases with cytochrome P450 selective substrates and inhibitors. J Enzyme Inhib Med Chem26:386-93 (2011) 
 
UDP-glucuronosyltransferase 1-6
Name:UDP-glucuronosyltransferase 1-6
Type:Enzyme
Mol. Mass.:60765.14
Organism:Homo sapiens (Human)
Description:P19224
Residue:532
BDBM234400
1-Naphthol
NameBDBM234400
Synonyms:Chlormethiazole
TypeSmall organic molecule
Emp. Form.C6H8ClNS
Mol. Mass.161.652
SMILESCc1ncsc1CCCl