Reaction Details
TargetUDP-glucuronosyltransferase 2B7
LigandBDBM12342
Substrate/CompetitorDiclofenac
Meas. Tech.UDP-glucuronosyltransferase Activity Assay
IC50>3.00e+5±n/a nM
Citation Liu, YShe, MWu, ZDai, R The inhibition study of human UDP-glucuronosyltransferases with cytochrome P450 selective substrates and inhibitors. J Enzyme Inhib Med Chem26:386-93 (2011) 
 
UDP-glucuronosyltransferase 2B7
Name:UDP-glucuronosyltransferase 2B7
Type:Enzyme
Mol. Mass.:60705.98
Organism:Homo sapiens (Human)
Description:P16662
Residue:529
BDBM12342
Diclofenac
NameBDBM12342
Synonyms:2H-chromen-2-one Coumarin
TypeNatural product
Emp. Form.C9H6O2
Mol. Mass.146.1427
SMILESO=c1ccc2ccccc2o1