Reaction Details
TargetUDP-glucuronosyltransferase 2B10
LigandBDBM50027886
Substrate/CompetitorDiclofenac
Meas. Tech.UDP-glucuronosyltransferase Activity Assay
IC50>3.00e+5±n/a nM
Citation Liu, YShe, MWu, ZDai, R The inhibition study of human UDP-glucuronosyltransferases with cytochrome P450 selective substrates and inhibitors. J Enzyme Inhib Med Chem26:386-93 (2011) 
 
UDP-glucuronosyltransferase 2B10
Name:UDP-glucuronosyltransferase 2B10
Type:Enzyme
Mol. Mass.:60792.40
Organism:Homo sapiens (Human)
Description:P36537
Residue:528
BDBM50027886
Diclofenac
NameBDBM50027886
Synonyms:1-Butyl-3-(p-methylphenylsulfonyl)urea 1-Butyl-3-tosylurea N-(4-Methylphenylsulfonyl)-N'-butylurea N-Butyl-N'-(p-tolylsulfonyl)urea N-n-Butyl-N'-tosylurea TOLBUTAMIDE
TypeSmall organic molecule
Emp. Form.C12H18N2O3S
Mol. Mass.270.348
SMILESCCCCNC(=O)NS(=O)(=O)c1ccc(C)cc1