Reaction Details
TargetL-lactate dehydrogenase C chain
LigandBDBM23222
Substrate/Competitorn/a
Meas. Tech.LDH Activity Assay
pH7.4±n/a
IC50 30000±n/a nM
Commentsextracted
Citation Rodríguez-Páez, LChena-Taboada, MACabrera-Hernández, ACordero-Martínez, JWong, C Oxamic acid analogues as LDH-C4-specific competitive inhibitors. J Enzyme Inhib Med Chem26:579-86 (2011) 
 
L-lactate dehydrogenase C chain
Name:L-lactate dehydrogenase C chain
Type:Enzyme
Mol. Mass.:35917.99
Organism:Mus musculus (Mouse)
Description:P00342
Residue:332
BDBM23222
NameBDBM23222
Synonyms:Oxalamic acid Oxamate, 3 carbamoylformic acid
TypeSmall organic molecule
Emp. Form.C2H3NO3
Mol. Mass.89.0501
SMILESNC(=O)C(O)=O