Reaction Details
TargetPlasmepsin II
LigandBDBM234503
Substrate/Competitorn/a
Meas. Tech.Enzyme Inhibition Assay
pH4.5±n/a
Temperature298.15±n/a K
IC50 13±n/a nM
Commentsextracted
Citation Chen, XDing, KMeyers, MJTortorella, MDXu, J Compositions and methods for the treatment of malaria US Patent US9353089 Publication Date 5/31/2016
 
Plasmepsin II
Name:Plasmepsin II
Type:Enzyme
Mol. Mass.:51482.09
Organism:Plasmodium falciparum
Description:P46925
Residue:453
BDBM234503
NameBDBM234503
Synonyms:US9353089, 136
TypeSmall organic molecule
Emp. Form.C26H26N4O
Mol. Mass.410.5108
SMILESN=C1NC(C(=O)N1C1CCCCC1)(c1ccccc1)c1cccc(c1)-c1cccnc1