Reaction Details
TargetPlasmepsin II
LigandBDBM234551
Substrate/Competitorn/a
Meas. Tech.Enzyme Inhibition Assay
pH4.5±n/a
Temperature298.15±n/a K
IC50 11.3±n/a nM
Commentsextracted
Citation Chen, XDing, KMeyers, MJTortorella, MDXu, J Compositions and methods for the treatment of malaria US Patent US9353089 Publication Date 5/31/2016
 
Plasmepsin II
Name:Plasmepsin II
Type:Enzyme
Mol. Mass.:51482.09
Organism:Plasmodium falciparum
Description:P46925
Residue:453
BDBM234551
NameBDBM234551
Synonyms:US9353089, 324
TypeSmall organic molecule
Emp. Form.C27H27N3O3
Mol. Mass.441.5216
SMILESCOc1cccc(c1)-c1cccc(c1)C1(NC(=N)N(C2CCOCC2)C1=O)c1ccccc1