Reaction Details
TargetCholesteryl ester transfer protein
LigandBDBM234607
Substrate/Competitorn/a
Meas. Tech.In Vitro Radioactive Assays of CETP-Catalyzed CE and TG Transfer (RTA Assay)
pH7.4±n/a
Temperature310.15±n/a K
IC50 3±n/a nM
Commentsextracted
Citation Acton, III, JJYe, FVachal, PSha, DDropinski, JFChu, LOndeyka, DKim, AJColandrea, VJZang, YZhang, FDong, G Cyclic amine substituted heterocyclic CETP inhibitors US Patent US9353101 Publication Date 5/31/2016
 
Cholesteryl ester transfer protein
Name:Cholesteryl ester transfer protein
Type:Enzyme
Mol. Mass.:54751.53
Organism:Homo sapiens (Human)
Description:P11597
Residue:493
BDBM234607
NameBDBM234607
Synonyms:US9353101, 3
TypeSmall organic molecule
Emp. Form.C31H27F7N6O3S
Mol. Mass.696.638
SMILESCOc1ncc(cc1-c1cnc(nc1CN1[C@@H](C)[C@H](OC1=O)c1cc(cc(c1)C(F)(F)F)C(F)(F)F)N1CC(F)C1)-c1sc(C)nc1C