Reaction Details
TargetCalcium/calmodulin-dependent protein kinase type II subunit delta
LigandBDBM292446
Substrate/Competitorn/a
Meas. Tech.CaMKII Cell-Based Activity
EC50 10.5±n/a nM
Citation Elzein, EKalla, RVKoltun, DLi, XParkhill, EQPerry, TSimonovich, SPZablocki, JZiebenhaus, CA Fused heterocyclic compounds as CaM kinase inhibitors US Patent US10100058 Publication Date 10/16/2018
 
Calcium/calmodulin-dependent protein kinase type II subunit delta
Name:Calcium/calmodulin-dependent protein kinase type II subunit delta
Type:Enzyme Catalytic Domain
Mol. Mass.:56419.78
Organism:Homo sapiens (Human)
Description:Q13557
Residue:499
BDBM292446
NameBDBM292446
Synonyms:(S)-2-amino-N-(2-(diethylamino)propyl)-6-(5-(thiophen-2-yl)pyrazolo[1,5-a]pyrimidin-3-yl)isonicotinamide | US10100058, Example 102
TypeSmall organic molecule
Emp. Form.C23H27N7OS
Mol. Mass.449.572
SMILESCCN(CC)[C@@H](C)CNC(=O)c1cc(N)nc(c1)-c1cnn2ccc(nc12)-c1cccs1