Reaction Details
TargetCalcium/calmodulin-dependent protein kinase type II subunit delta
LigandBDBM292565
Substrate/Competitorn/a
Meas. Tech.CaMKII Cell-Based Activity
EC50 22.3±n/a nM
Citation Elzein, EKalla, RVKoltun, DLi, XParkhill, EQPerry, TSimonovich, SPZablocki, JZiebenhaus, CA Fused heterocyclic compounds as CaM kinase inhibitors US Patent US10100058 Publication Date 10/16/2018
 
Calcium/calmodulin-dependent protein kinase type II subunit delta
Name:Calcium/calmodulin-dependent protein kinase type II subunit delta
Type:Enzyme Catalytic Domain
Mol. Mass.:56419.78
Organism:Homo sapiens (Human)
Description:Q13557
Residue:499
BDBM292565
NameBDBM292565
Synonyms:(S)-N-(2-(diethylamino)propyl)-2-((3-hydroxy-3-methylbutyl)amino)-6-(5-(thiophen-2-yl)pyrazolo[1,5-a]pyrimidin-3-yl)isonicotinamide | US10100058, Example 221
TypeSmall organic molecule
Emp. Form.C28H37N7O2S
Mol. Mass.535.704
SMILESCCN(CC)[C@@H](C)CNC(=O)c1cc(NCCC(C)(C)O)nc(c1)-c1cnn2ccc(nc12)-c1cccs1