Reaction Details
TargetCalcium/calmodulin-dependent protein kinase type II subunit delta
LigandBDBM292573
Substrate/Competitorn/a
Meas. Tech.CaMKII Cell-Based Activity
EC50 34.6±n/a nM
Citation Elzein, EKalla, RVKoltun, DLi, XParkhill, EQPerry, TSimonovich, SPZablocki, JZiebenhaus, CA Fused heterocyclic compounds as CaM kinase inhibitors US Patent US10100058 Publication Date 10/16/2018
 
Calcium/calmodulin-dependent protein kinase type II subunit delta
Name:Calcium/calmodulin-dependent protein kinase type II subunit delta
Type:Enzyme Catalytic Domain
Mol. Mass.:56419.78
Organism:Homo sapiens (Human)
Description:Q13557
Residue:499
BDBM292573
NameBDBM292573
Synonyms:(S)-N-(2-(diethylamino)propyl)-2-((2-hydroxyethyl)amino)-6-(5-(thiophen-2-yl)pyrazolo[1,5-a]pyrimidin-3-yl)isonicotinamide | US10100058, Example 229
TypeSmall organic molecule
Emp. Form.C25H31N7O2S
Mol. Mass.493.624
SMILESCCN(CC)[C@@H](C)CNC(=O)c1cc(NCCO)nc(c1)-c1cnn2ccc(nc12)-c1cccs1