Reaction Details
TargetCalcium/calmodulin-dependent protein kinase type II subunit delta
LigandBDBM292697
Substrate/Competitorn/a
Meas. Tech.CaMKII Cell-Based Activity
EC50 38.4±n/a nM
Citation Elzein, EKalla, RVKoltun, DLi, XParkhill, EQPerry, TSimonovich, SPZablocki, JZiebenhaus, CA Fused heterocyclic compounds as CaM kinase inhibitors US Patent US10100058 Publication Date 10/16/2018
 
Calcium/calmodulin-dependent protein kinase type II subunit delta
Name:Calcium/calmodulin-dependent protein kinase type II subunit delta
Type:Enzyme Catalytic Domain
Mol. Mass.:56419.78
Organism:Homo sapiens (Human)
Description:Q13557
Residue:499
BDBM292697
NameBDBM292697
Synonyms:(S)-N-(2-(diethylamino)propyl)-2-(2-hydroxy-2-methylpropoxy)-6-(5-(thiophen-2-yl)pyrazolo[1,5-a]pyrimidin-3-yl)isonicotinamide | US10100058, Example 353
TypeSmall organic molecule
Emp. Form.C27H34N6O3S
Mol. Mass.522.662
SMILESCCN(CC)[C@@H](C)CNC(=O)c1cc(OCC(C)(C)O)nc(c1)-c1cnn2ccc(nc12)-c1cccs1