Reaction Details
TargetIsoform PDE10A2 of cAMP and cAMP-inhibited cGMP 3',5'-cyclic phosphodiesterase 10A (PDE10A2)
LigandBDBM234819
Substrate/Competitorn/a
Meas. Tech.Fluorescence Polarization Assay
Ki 0.002±n/a nM
Citation Kuduk, SDMcComas, CCReger, TSQi, C Substituted pyridizinone derivatives as PDE10 inhibitors US Patent US9353104 Publication Date 5/31/2016
 
Isoform PDE10A2 of cAMP and cAMP-inhibited cGMP 3',5'-cyclic phosphodiesterase 10A (PDE10A2)
Name:Isoform PDE10A2 of cAMP and cAMP-inhibited cGMP 3',5'-cyclic phosphodiesterase 10A (PDE10A2)
Type:Enzyme
Mol. Mass.:89387.03
Organism:Homo sapiens (Human)
Description:Q9Y233-2
Residue:789
BDBM234819
NameBDBM234819
Synonyms:US9353104, 124
TypeSmall organic molecule
Emp. Form.C22H25N5O2S
Mol. Mass.423.531
SMILESCc1cnc(CNc2cc(OC[C@H]3C[C@@H]3c3ccc4CCCc4n3)nn(C)c2=O)s1