Reaction Details
TargetIsoform PDE10A2 of cAMP and cAMP-inhibited cGMP 3',5'-cyclic phosphodiesterase 10A (PDE10A2)
LigandBDBM234825
Substrate/Competitorn/a
Meas. Tech.Fluorescence Polarization Assay
Ki 0.004±n/a nM
Citation Kuduk, SDMcComas, CCReger, TSQi, C Substituted pyridizinone derivatives as PDE10 inhibitors US Patent US9353104 Publication Date 5/31/2016
 
Isoform PDE10A2 of cAMP and cAMP-inhibited cGMP 3',5'-cyclic phosphodiesterase 10A (PDE10A2)
Name:Isoform PDE10A2 of cAMP and cAMP-inhibited cGMP 3',5'-cyclic phosphodiesterase 10A (PDE10A2)
Type:Enzyme
Mol. Mass.:89387.03
Organism:Homo sapiens (Human)
Description:Q9Y233-2
Residue:789
BDBM234825
NameBDBM234825
Synonyms:US9353104, 130
TypeSmall organic molecule
Emp. Form.C20H23N5O3S
Mol. Mass.413.493
SMILESCOc1ccc(nc1)[C@H]1C[C@@H]1COc1cc(NCc2ncc(C)s2)c(=O)n(C)n1