Reaction Details
TargetEpidermal growth factor receptor [T790M,L858R]
LigandBDBM50322823
Substrate/Competitorn/a
Meas. Tech.Enzyme Assay
IC50 47±n/a nM
Citation Xia, XZhang, D Substituted aminoquinazolines useful as kinases inhibitors US Patent US9388170 Publication Date 7/12/2016
 
Epidermal growth factor receptor [T790M,L858R]
Name:Epidermal growth factor receptor [T790M,L858R]
Type:n/a
Mol. Mass.:134353.72
Organism:Homo sapiens (Human)
Description:P00533[T790M,L858R]
Residue:1210
BDBM50322823
NameBDBM50322823
Synonyms:(S)-N-(4-(3-chloro-4-fluorophenylamino)-7-(tetrahydrofuran-3-yloxy)quinazolin-6-yl)-4-(dimethylamino)but-2-enamide CHEMBL1173655 US10196365, Afatinib US9388170, Afatinib WO2022090481, Example afatinib
TypeSmall organic molecule
Emp. Form.C24H25ClFN5O3
Mol. Mass.485.938
SMILESCN(C)C\C=C\C(=O)Nc1cc2c(Nc3ccc(F)c(Cl)c3)ncnc2cc1O[C@H]1CCOC1