Reaction Details
TargetcDNA, FLJ78895, highly similar to 3-oxo-5-alpha-steroid 4-dehydrogenase 1
LigandBDBM235654
Substrate/Competitorn/a
Meas. Tech.5α-Reductase Activity Assay
pH6.5±0
Temperature310.15±0 K
IC50 500±30 nM
Citation Cabeza, MTrejo, KVGonzález, CGarcía, PSoriano, JHeuze, YBratoeff, E Steroidal 5a-reductase inhibitors using 4-androstenedione as substrate. J Enzyme Inhib Med Chem26:712-9 (2011) 
 
cDNA, FLJ78895, highly similar to 3-oxo-5-alpha-steroid 4-dehydrogenase 1
Name:cDNA, FLJ78895, highly similar to 3-oxo-5-alpha-steroid 4-dehydrogenase 1
Synonyms:5-alpha-Reductase (5α-Reductase)
Type:Enzyme
Mol. Mass.:24182.16
Organism:Homo sapiens (Human)
Description:EC 1.3.99.5; B7Z4L2
Residue:212
BDBM235654
NameBDBM235654
Synonyms:3,20-Dioxopregn-4-ene-17-yl acetate (4)
TypeSmall organic molecule
Emp. Form.C23H32O4
Mol. Mass.372.4978
SMILESCC(=O)O[C@@]1(CCC2C3CCC4=CC(=O)CCC4(C)C3CCC12C)C(C)=O