Reaction Details
TargetCarbonic anhydrase 3 + BH
LigandBDBM10880
Substrate/Competitorn/a
Meas. Tech.CA Activity Assay
pH7.5±n/a
Ki 534±0.0 nM
Comments0 mM acetaldehyde extracted
Citation Bootorabi, FJänis, JHytönen, VPValjakka, JKuuslahti, MVullo, DNiemelä, OSupuran, CTParkkila, S Acetaldehyde-derived modifications on cytosolic human carbonic anhydrases. J Enzyme Inhib Med Chem26:862-70 (2011) 
 
Carbonic anhydrase 3 + BH
Name:Carbonic anhydrase 3 + BH
Synonyms:CA III + BH
Type:Protein
Mol. Mass.:n/a
Description:n/a
Components:This complex has 2 components.
Component 1
Name:Carbonic anhydrase 3
Type:Enzyme
Mol. Mass.:29562.11
Organism:Homo sapiens (Human)
Description:Human cloned isozyme.
Residue:260
Component 2
NameBDBM235669
Synonyms:Sodium cyanoborohydride
TypeSmall organic molecule
Emp. Form.CH3BN
Mol. Mass.39.853
SMILES[BH3-]C#N
BDBM10880
NameBDBM10880
Synonyms:AZA AZM acetazolamide Acetazolamide Acetazolamide (AZA) Acetazolamide, 5 Acetazolamide, AZA CHEMBL20 Sulfonamide, 1 US11278534, Example acetazolamide sulfonamide 1
TypeSmall organic molecule
Emp. Form.C4H6N4O3S2
Mol. Mass.222.245
SMILESCC(=O)Nc1nnc(s1)S(N)(=O)=O