Reaction Details
TargetCarbonic anhydrase 2
LigandBDBM50022271
Substrate/Competitorn/a
Meas. Tech.CA Enzyme Assay
pH10±n/a
IC50 1.850e+6±n/a nM
Commentsextracted
Citation Gökçe, BGençer, NArslan, OTurkoglu, SAAlper, MKöçkar, F Evaluation of in vitro effects of some analgesic drugs on erythrocyte and recombinant carbonic anhydrase I and II. J Enzyme Inhib Med Chem27:37-42 (2012) 
 
Carbonic anhydrase 2
Name:Carbonic anhydrase 2
Type:Enzyme
Mol. Mass.:29250.71
Organism:Homo sapiens (Human)
Description:P00918
Residue:260
BDBM50022271
NameBDBM50022271
Synonyms:2-(3-Benzoylphenyl)propionic acid 3-Benzoyl-alpha-methylbenzeneacetic acid CHEMBL571 KETOPROFEN Orudis (TN) | m-Benzoylhydratropic acid
TypeSmall organic molecule
Emp. Form.C16H14O3
Mol. Mass.254.2806
SMILESCC(C(O)=O)c1cccc(c1)C(=O)c1ccccc1