Reaction Details
Target72 kDa type IV collagenase
LigandBDBM23971
Substrate/Competitorn/a
Meas. Tech.In Vitro MMP-2 Inhibition Assay
pH8.5±n/a
Temperature298.15±n/a K
IC50 167000±2800 nM
Commentsextracted
Citation Yang, KFen, JFang, HZhang, LGong, JXu, W Synthesis of a novel series of L-isoserine derivatives as aminopeptidase N inhibitors. J Enzyme Inhib Med Chem27:302-10 (2012) 
 
72 kDa type IV collagenase
Name:72 kDa type IV collagenase
Type:Enzyme
Mol. Mass.:73870.36
Organism:Homo sapiens (Human)
Description: P08253
Residue:660
BDBM23971
NameBDBM23971
Synonyms:(2S)-2-[(2S,3R)-3-amino-2-hydroxy-4-phenylbutanamido]-4-methylpentanoic acid CHEMBL29292 | Ubenimex
TypeSmall organic molecule
Emp. Form.C16H24N2O4
Mol. Mass.308.3728
SMILESCC(C)C[C@H](NC(=O)[C@@H](O)[C@H](N)Cc1ccccc1)C(O)=O