Reaction Details
TargetD(2) dopamine receptor
LigandBDBM50387560
Substrate/Competitorn/a
Meas. Tech.Affinity Assay
Temperature310.15±n/a K
EC50 16190±n/a nM
Commentsextracted
Citation Liu, HXie, XZhen, XSun, HLi, JZhu, LLi, ZChen, YJiang, HChen, K Hexahydrodibenzo[a,g]quinolizine compound, preparation method thereof, pharmaceutical composition and use thereof US Patent US9359372 Publication Date 6/7/2016
 
D(2) dopamine receptor
Name:D(2) dopamine receptor
Type:Cell-surface receptors
Mol. Mass.:50647.10
Organism:Homo sapiens (Human)
Description:P14416
Residue:443
BDBM50387560
NameBDBM50387560
Synonyms:CHEMBL2057451 | US9359372, DC037017
TypeSmall organic molecule
Emp. Form.C21H25NO2
Mol. Mass.323.4287
SMILESCOc1cc2CCN3Cc4c(C)cc(C)cc4C[C@H]3c2cc1OC