Reaction Details
TargetKappa-type opioid receptor
LigandBDBM235810
Substrate/Competitorn/a
Meas. Tech.Time Resolved Fluorescence Resonance Energy Transfer (TR-FRET)-Based cAMP Immunoassay
Temperature298.15±n/a K
EC50 0.036±n/a nM
Commentsextracted
Citation Schteingart, CDMenzaghi, FJiang, GAlexander, RVSueiras-Diaz, JSpencer, RHChalmers, DTLuo, RZ Synthetic peptide amides US Patent US9359399 Publication Date 6/7/2016
 
Kappa-type opioid receptor
Name:Kappa-type opioid receptor
Type:Enzyme
Mol. Mass.:42656.78
Organism:Mus musculus (Mouse)
Description:P33534
Residue:380
BDBM235810
NameBDBM235810
Synonyms:US9359399, 24
TypeSmall organic molecule
Emp. Form.C36H55N11O4
Mol. Mass.705.8932
SMILESCC(C)C[C@@H](NC(=O)[C@@H](Cc1ccccc1)NC(=O)[C@H](N)Cc1ccccc1)C(=O)N[C@H](CCCNC(N)=N)C(=O)N1CCCN(CC1)C(N)=N