Reaction Details
TargetVascular endothelial growth factor receptor 2
LigandBDBM235824
Substrate/Competitorn/a
Meas. Tech.Kinase Inhibition Assay
IC50 1209±n/a nM
Citation Dannhardt, GPlutizki, SKramb, JMüller, AMöhler, M 3-(indolyl)- or 3-(azaindolyl)- 4-arylmaleimide derivatives for use in the treatment of colon and gastric adenocarcinoma US Patent US9364459 Publication Date 6/14/2016
 
Vascular endothelial growth factor receptor 2
Name:Vascular endothelial growth factor receptor 2
Type:Receptor Tyrosine Kinase
Mol. Mass.:151510.97
Organism:Homo sapiens (Human)
Description:P35968
Residue:1356
BDBM235824
NameBDBM235824
Synonyms:US9364459, L
TypeSmall organic molecule
Emp. Form.C28H31N3O5
Mol. Mass.489.5628
SMILESCOc1cc(cc(OC)c1OC)C1=C(C(=O)NC1=O)c1cn(CCN2CCCCC2)c2ccccc12