Reaction Details
TargetGlycogen synthase kinase-3 beta
LigandBDBM47165
Substrate/Competitorn/a
Meas. Tech.Kinase Inhibition Assay
IC50 2±n/a nM
Citation Dannhardt, GPlutizki, SKramb, JMüller, AMöhler, M 3-(indolyl)- or 3-(azaindolyl)- 4-arylmaleimide derivatives for use in the treatment of colon and gastric adenocarcinoma US Patent US9364459 Publication Date 6/14/2016
 
Glycogen synthase kinase-3 beta
Name:Glycogen synthase kinase-3 beta
Type:Enzyme
Mol. Mass.:46756.38
Organism:Homo sapiens (Human)
Description:P49841
Residue:420
BDBM47165
NameBDBM47165
Synonyms:US8957103, C1 | US9364459, I
Typen/a
Emp. Form.C24H24N2O6
Mol. Mass.436.4572
SMILESCOc1cc(cc(OC)c1OC)C1=C(C(=O)NC1=O)c1cn(CCCO)c2ccccc12