Reaction Details
TargetGlycogen synthase kinase-3 beta
LigandBDBM235824
Substrate/Competitorn/a
Meas. Tech.Kinase Inhibition Assay
IC50>1000±n/a nM
Citation Dannhardt, GPlutizki, SKramb, JMüller, AMöhler, M 3-(indolyl)- or 3-(azaindolyl)- 4-arylmaleimide derivatives for use in the treatment of colon and gastric adenocarcinoma US Patent US9364459 Publication Date 6/14/2016
 
Glycogen synthase kinase-3 beta
Name:Glycogen synthase kinase-3 beta
Type:Enzyme
Mol. Mass.:46756.38
Organism:Homo sapiens (Human)
Description:P49841
Residue:420
BDBM235824
NameBDBM235824
Synonyms:US9364459, L
TypeSmall organic molecule
Emp. Form.C28H31N3O5
Mol. Mass.489.5628
SMILESCOc1cc(cc(OC)c1OC)C1=C(C(=O)NC1=O)c1cn(CCN2CCCCC2)c2ccccc12