Reaction Details
TargetDisintegrin and metalloproteinase domain-containing protein 9
LigandBDBM113588
Substrate/Competitorn/a
Meas. Tech.Inhibition Assay
IC50 9254±n/a nM
Citation Clary, LChambon, SChantalat, LRosignoli, CRoye, OPascal, JSchuppli-Nollet, M Benzenesulfonamide compounds, method for synthesizing same, and use thereof in medicine as well as in cosmetics US Patent US9365529 Publication Date 6/14/2016
 
Disintegrin and metalloproteinase domain-containing protein 9
Name:Disintegrin and metalloproteinase domain-containing protein 9
Type:Enzyme
Mol. Mass.:90567.68
Organism:Homo sapiens (Human)
Description:Q13443
Residue:819
BDBM113588
NameBDBM113588
Synonyms:US8633196, 18 | US9365529, 18
TypeSmall organic molecule
Emp. Form.C31H34FN5O5S
Mol. Mass.607.696
SMILESCc1cc(COc2ccc(cc2)S(=O)(=O)NC[C@H](N2CCN(Cc3ccc(F)cc3)CC2)C(=O)NO)c2ccccc2n1