Reaction Details
TargetLysosomal Pro-X carboxypeptidase
LigandBDBM235953
Substrate/Competitorn/a
Meas. Tech.Enzyme Activity Assay
pH5.5±n/a
IC50 0.035±n/a nM
Commentsextracted
Citation Hale, JJJiang, JShen, DShi, ZShu, MWu, ZYang, C Prolylcarboxypeptidase inhibitors US Patent US9365539 Publication Date 6/14/2016
 
Lysosomal Pro-X carboxypeptidase
Name:Lysosomal Pro-X carboxypeptidase
Type:Enzyme
Mol. Mass.:55805.19
Organism:Homo sapiens (Human)
Description:P42785
Residue:496
BDBM235953
NameBDBM235953
Synonyms:US9365539, 33
TypeSmall organic molecule
Emp. Form.C28H28FN5O2
Mol. Mass.485.5526
SMILESCOC(=O)C(CN1CCC(CC1)c1cc(nn1-c1ncccn1)-c1ccc(F)cc1)c1ccccc1