Reaction Details
TargetCellular tumor antigen p53 [18-26]/Protein Mdm4 [2-185]
LigandBDBM236485
Substrate/Competitorn/a
Meas. Tech.Time Resolved Fluorescence Energy Transfer (TR-FRET) Assay
Temperature298.15±n/a K
IC50>100000±n/a nM
Commentsextracted
Citation Cotesta, SFuret, PGuagnano, VHolzer, PKallen, JMah, RMasuya, KSchlapbach, AStutz, SVaupel, A Pyrrolopyrrolidinone compounds US Patent US9365576 Publication Date 6/14/2016
 
Cellular tumor antigen p53 [18-26]/Protein Mdm4 [2-185]
Name:Cellular tumor antigen p53 [18-26]/Protein Mdm4 [2-185]
Synonyms:p53-MDM4
Type:Protein
Mol. Mass.:n/a
Description:n/a
Components:This complex has 2 components.
Component 1
Name:Cellular tumor antigen p53 [18-26]
Type:Protein
Mol. Mass.:1122.31
Organism:Homo sapiens (Human)
Description:aa 18-26
Residue:9
TFSDLWKLL
Component 2
Name:Protein Mdm4 [2-185]
Synonyms:E3 ubiquitin-protein ligase Mdm4 MDM4_HUMAN p53-binding protein Mdm4
Type:Protein
Mol. Mass.:20438.64
Organism:Homo sapiens (Human)
Description:aa 2-185
Residue:184
BDBM236485
NameBDBM236485
Synonyms:US9365576, 241
TypeSmall organic molecule
Emp. Form.C27H24ClN5O3
Mol. Mass.501.964
SMILESCOc1ncc(cn1)-c1cc2C(=O)N(C(c2n1C1CC1)c1ccc(Cl)cc1)c1cc(C)c(=O)n(C)c1