Reaction Details
TargetHistone-lysine N-methyltransferase EZH2
LigandBDBM172038
Substrate/Competitorn/a
Meas. Tech.Enzyme Assay
Temperature298.15±n/a K
IC50 11.07±n/a nM
Commentsextracted
Citation Kuntz, KWHuang, KChoi, HWSanders, KMathieu, SChanda, AFang, F Salt form of a human histone methyltransferase EZH2 inhibitor US Patent US9394283 Publication Date 7/19/2016
 
Histone-lysine N-methyltransferase EZH2
Name:Histone-lysine N-methyltransferase EZH2
Type:Protein
Mol. Mass.:85367.84
Organism:Homo sapiens (Human)
Description:Q15910
Residue:746
BDBM172038
NameBDBM172038
Synonyms:US10155002, Compound 44 US11052093, Compound 143 US9090562, 143 US9394283, 1
TypeSmall organic molecule
Emp. Form.C34H44N4O4
Mol. Mass.572.7376
SMILESCCN(C1CCOCC1)c1cc(cc(C(=O)NCc2c(C)cc(C)[nH]c2=O)c1C)-c1ccc(CN2CCOCC2)cc1