Reaction Details
TargetCarbonic anhydrase 6
LigandBDBM236511
Substrate/Competitorn/a
Meas. Tech.CA Activity Assay
pH7.4±0
Temperature298.15±0 K
Ki 5.8e+2±n/a nM
Citation Sentürk, MEkinci, DGöksu, SSupuran, CT Effects of dopaminergic compounds on carbonic anhydrase isozymes I, II, and VI. J Enzyme Inhib Med Chem27:365-9 (2012) 
 
Carbonic anhydrase 6
Name:Carbonic anhydrase 6
Type:Enzyme
Mol. Mass.:35371.40
Organism:Homo sapiens (Human)
Description:P23280
Residue:308
BDBM236511
NameBDBM236511
Synonyms:CA inhibitor, 6
TypeSmall organic molecule
Emp. Form.C9H10BrN
Mol. Mass.212.086
SMILESNC1Cc2ccc(Br)cc2C1