Reaction Details
TargetBeta-glucuronidase
LigandBDBM236512
Substrate/Competitorn/a
Meas. Tech.β-Glucuronidase Inhibition Assay
pH7±0
Temperature310.15±0 K
IC50 3.735e+5± 9.57e+3 nM
Citation Choudhary, MIZafar, SKhan, NTAhmad, SNoreen, SMarasini, BPAl-Khedhairy, AAAtta-Ur-Rahman, null Biotransformation of dehydroepiandrosterone with Macrophomina phaseolina and ß-glucuronidase inhibitory activity of transformed products. J Enzyme Inhib Med Chem27:348-55 (2012) 
 
Beta-glucuronidase
Name:Beta-glucuronidase
Type:Protein
Mol. Mass.:68431.57
Organism:Escherichia coli (Enterobacteria)
Description:P05804
Residue:603
BDBM236512
NameBDBM236512
Synonyms:Androstane-3,17-dione (2)
TypeSmall organic molecule
Emp. Form.C19H28O2
Mol. Mass.288.4244
SMILESC[C@]12CC[C@H]3[C@@H](CCC4CC(=O)CC[C@]34C)[C@@H]1CCC2=O