Reaction Details
TargetBeta-glucuronidase
LigandBDBM91713
Substrate/Competitorn/a
Meas. Tech.β-Glucuronidase Inhibition Assay
pH7±0
Temperature310.15±0 K
IC50 4.30e+5± 7.13e+3 nM
Citation Choudhary, MIZafar, SKhan, NTAhmad, SNoreen, SMarasini, BPAl-Khedhairy, AAAtta-Ur-Rahman, null Biotransformation of dehydroepiandrosterone with Macrophomina phaseolina and ß-glucuronidase inhibitory activity of transformed products. J Enzyme Inhib Med Chem27:348-55 (2012) 
 
Beta-glucuronidase
Name:Beta-glucuronidase
Type:Protein
Mol. Mass.:68431.57
Organism:Escherichia coli (Enterobacteria)
Description:P05804
Residue:603
BDBM91713
NameBDBM91713
Synonyms:Androst-4-en-3,17-dione, 2 Androstenedione
TypeSmall organic molecule
Emp. Form.C19H26O2
Mol. Mass.286.4085
SMILESC[C@]12CC[C@H]3[C@@H](CCC4=CC(=O)CC[C@]34C)[C@@H]1CCC2=O