Reaction Details
TargetGag-Pol polyprotein [489-587,Q496K]
LigandBDBM293279
Substrate/Competitorn/a
Meas. Tech.Inhibition of HIV Replication
pH7.55±n/a
EC50<100±n/a nM
Commentsextracted
Citation Kadow, JFNaidu, BNTu, Y Pyridin-3-yl acetic acid derivatives as inhibitors of human immunodeficiency virus replication US Patent US10106504 Publication Date 10/23/2018
 
Gag-Pol polyprotein [489-587,Q496K]
Name:Gag-Pol polyprotein [489-587,Q496K]
Type:Enzyme Subunit
Mol. Mass.:10823.26
Organism:Human immunodeficiency virus type 1
Description:P12497[489-587,Q496K]
Residue:99
BDBM293279
NameBDBM293279
Synonyms:US10106504, Example 16
TypeSmall organic molecule
Emp. Form.C40H44FNO7
Mol. Mass.669.7783
SMILESCc1nc(COCC2COC2)c(-c2ccc(OCCc3ccc(F)cc3)cc2)c(-c2ccc3OCCCc3c2)c1[C@H](OC(C)(C)C)C(O)=O