Reaction Details
TargetGag-Pol polyprotein [489-587,Q496K]
LigandBDBM293314
Substrate/Competitorn/a
Meas. Tech.Inhibition of HIV Replication
pH7.55±n/a
EC50<100±n/a nM
Commentsextracted
Citation Kadow, JFNaidu, BNTu, Y Pyridin-3-yl acetic acid derivatives as inhibitors of human immunodeficiency virus replication US Patent US10106504 Publication Date 10/23/2018
 
Gag-Pol polyprotein [489-587,Q496K]
Name:Gag-Pol polyprotein [489-587,Q496K]
Type:Enzyme Subunit
Mol. Mass.:10823.26
Organism:Human immunodeficiency virus type 1
Description:P12497[489-587,Q496K]
Residue:99
BDBM293314
NameBDBM293314
Synonyms:US10106504, Example 51
TypeSmall organic molecule
Emp. Form.C39H42ClFN2O4
Mol. Mass.657.213
SMILESCc1cccc(Cl)c1CN1CCc2cc(ccc2C1)-c1c(C)nc(C)c([C@H](OC(C)(C)C)C(O)=O)c1-c1cc(F)c2OCCCc2c1