Reaction Details
TargetGenome polyprotein [1027-1711]
LigandBDBM236569
Substrate/Competitorn/a
Meas. Tech.Inhibition Assay
pH7.5±n/a
Ki 0.5±n/a nM
Commentsextracted
Citation Raboisson, PJDe Kock, HAMcGowan, DCHu, LTahri, AVendeville, SMVan De Vreken, W Macrocyclic inhibitors of hepatitis C virus US Patent US9365582 Publication Date 6/14/2016
 
Genome polyprotein [1027-1711]
Name:Genome polyprotein [1027-1711]
Type:n/a
Mol. Mass.:72913.15
Organism:Hepatitis C virus genotype 1a (strain H77) (HCV)
Description:amino acids 1027 to 1711
Residue:685
BDBM236569
NameBDBM236569
Synonyms:US9365582, 11
TypeSmall organic molecule
Emp. Form.C32H39ClN4O7S
Mol. Mass.659.193
SMILESCCOc1cc(O[C@@H]2C[C@@H]3[C@@H](C2)C(=O)N(C)CCCC\C=C/[C@@H]2C[C@]2(NC3=O)C(=O)NS(=O)(=O)C2CC2)c2cccc(Cl)c2n1