Reaction Details
TargetBeta-secretase 1
LigandBDBM236594
Substrate/Competitorn/a
Meas. Tech.HTRF FRET Assay
pH5±n/a
Temperature303.15±n/a K
Ki 1±n/a nM
Commentsextracted
Citation Cumming, JNKaelin, Jr., DEScott, JDWu, WBurnett, DA C5, C6 oxacyclic-fused thiazine dioxide compounds as BACE inhibitors, compositions, and their use US Patent US9365589 Publication Date 6/14/2016
 
Beta-secretase 1
Name:Beta-secretase 1
Type:Protein
Mol. Mass.:55755.10
Organism:Homo sapiens (Human)
Description:P56817
Residue:501
BDBM236594
NameBDBM236594
Synonyms:US9365589, 1u
TypeSmall organic molecule
Emp. Form.C22H22FN5O4S
Mol. Mass.471.505
SMILESCc1cc(cnc1C(=O)Nc1ccc(F)c(c1)[C@]12COC[C@H]1S(=O)(=O)C(C)(C)C(=N)N2)C#N