Reaction Details
TargetBeta-secretase 1
LigandBDBM236603
Substrate/Competitorn/a
Meas. Tech.HTRF FRET Assay
pH5±n/a
Temperature303.15±n/a K
Ki 1±n/a nM
Commentsextracted
Citation Cumming, JNKaelin, Jr., DEScott, JDWu, WBurnett, DA C5, C6 oxacyclic-fused thiazine dioxide compounds as BACE inhibitors, compositions, and their use US Patent US9365589 Publication Date 6/14/2016
 
Beta-secretase 1
Name:Beta-secretase 1
Type:Protein
Mol. Mass.:55755.10
Organism:Homo sapiens (Human)
Description:P56817
Residue:501
BDBM236603
NameBDBM236603
Synonyms:US9365589, 4c | US9365589, 4f
TypeSmall organic molecule
Emp. Form.C21H21ClF2N4O4S
Mol. Mass.498.931
SMILESCC1(C)C(=N)N[C@]2(COC(CF)[C@H]2S1(=O)=O)c1cc(NC(=O)c2ccc(Cl)cn2)ccc1F